This is stuck in -proposed due to some test failures.
a. snapd's autopkgtests are failing. I'm not sure why but it's failing against a bunch of stuff, and unlikely to be related to openssh. For this, I think just wait until snapd gets sorted.
15:37:47.745132692 E: run test sftp-chroot.sh ...
15:37:47.815324958 O:
15:37:47.818687482 O: WARNING: Unsafe (group or world writable) directory permissions found:
15:37:47.821470734 O: /tmp/autopkgtest.BMCGDj /tmp
15:37:47.824349161 O:
15:37:47.828068207 O: These could be abused to locally escalate privileges. If you are
15:37:47.831098208 O: sure that this is not a risk (eg there are no other users), you can
15:37:47.834369382 O: bypass this check by setting TEST_SSH_UNSAFE_PERMISSIONS=1
15:37:47.838832596 O:
15:37:48.389593715 O: test sftp in chroot: get
15:37:49.220480056 O: FATAL: Fetch testdata_openssh-tests.10274 failed
15:37:49.272336819 E: make: *** [Makefile:214: t-exec] Error 1
15:37:49.272732416 O: make: Leaving directory '/tmp/autopkgtest.BMCGDj/autopkgtest_tmp/user/regress'
This is stuck in -proposed due to some test failures.
a. snapd's autopkgtests are failing. I'm not sure why but it's failing against a bunch of stuff, and unlikely to be related to openssh. For this, I think just wait until snapd gets sorted.
b. openssh's autopkgtest for armhf fails:
https:/ /autopkgtest. ubuntu. com/results/ autopkgtest- impish/ impish/ armhf/o/ openssh/ 20210915_ 153813_ 9f0ec@/ log.gz
15:37:47.745132692 E: run test sftp-chroot.sh ... t.BMCGDj /tmp UNSAFE_ PERMISSIONS= 1 openssh- tests.10274 failed st.BMCGDj/ autopkgtest_ tmp/user/ regress'
15:37:47.815324958 O:
15:37:47.818687482 O: WARNING: Unsafe (group or world writable) directory permissions found:
15:37:47.821470734 O: /tmp/autopkgtes
15:37:47.824349161 O:
15:37:47.828068207 O: These could be abused to locally escalate privileges. If you are
15:37:47.831098208 O: sure that this is not a risk (eg there are no other users), you can
15:37:47.834369382 O: bypass this check by setting TEST_SSH_
15:37:47.838832596 O:
15:37:48.389593715 O: test sftp in chroot: get
15:37:49.220480056 O: FATAL: Fetch testdata_
15:37:49.272336819 E: make: *** [Makefile:214: t-exec] Error 1
15:37:49.272732416 O: make: Leaving directory '/tmp/autopkgte
15:37:49.275848416 O: ==> /tmp/autopkgtes t.BMCGDj/ autopkgtest_ tmp/user/ regress/ failed- regress. log <== openssh- tests.10274 failed openssh- tests.10274 failed openssh- tests.10274 failed
15:37:49.278666043 O: trace: test sftp in chroot: get
15:37:49.279119015 E: tail: error writing 'standard output': Resource temporarily unavailable
15:37:49.281732694 O: Connection closed
15:37:49.284391098 O:
Connection closed.
15:37:49.287049577 O: FATAL: Fetch testdata_
15:37:49.289863204 O:
15:37:49.292443584 O: trace: test sftp in chroot: get
15:37:49.295060163 O: Connection closed
15:37:49.297757192 O:
Connection closed.
15:37:49.300477945 O: FATAL: Fetch testdata_
15:37:49.303095599 O: FAIL: Fetch testdata_
15:37:49.308296783 O: ==> /tmp/autopkgtes t.BMCGDj/ autopkgtest_ tmp/user/ regress/ failed- ssh.log <== use_uid: 1001/1001 (e=1001/1001) use_uid: 1001/1001 (e=0/0) handler: Child exited openssh- tests.10274 failed
...
15:37:51.474372804 O: debug3: channel 0: status: The following connections are open:
15:37:51.477102508 O: #0 server-session (t4 r0 i3/0 o3/0 e[closed]/0 fd -1/-1/-1 sock -1 cc -1)
15:37:51.479741212 O:
15:37:51.482360441 O: debug3: receive packet: type 1
15:37:51.485060819 O: Received disconnect from 127.0.0.1 port 51114:11: disconnected by user
15:37:51.487996046 O: Disconnected from user openssh-tests 127.0.0.1 port 51114
15:37:51.490691200 O: debug1: do_cleanup
15:37:51.493366103 O: debug1: temporarily_
15:37:51.501159391 O: debug1: restore_uid: (unprivileged)
15:37:51.503932169 O: debug3: mm_request_receive entering
15:37:51.506765122 O: debug1: do_cleanup
15:37:51.509590624 O: debug1: temporarily_
15:37:51.512431677 O: debug1: restore_uid: 0/0
15:37:51.515012731 O: debug1: audit_event: unhandled event 12
15:37:51.517875458 O: debug1: main_sigchld_
15:37:51.520917709 O: FATAL: Fetch testdata_
15:37:51.523740937 O: