rootskel version 1.96ubuntu1 failed to build in oneiric

Bug #829371 reported by Matthias Klose
This bug affects 1 person
Affects Status Importance Assigned to Milestone
rootskel (Ubuntu)

Bug Description

rootskel version 1.96ubuntu1 failed to build in oneiric
Link to failed build:

Details about the rebuild:

Direct link to the build log:

This log snippet might be of interest, since it triggered the matcher 'Purging chroot-autobuild'.
Excerpt 258 lines into the build log:

make[2]: Entering directory `/build/buildd/rootskel-1.96ubuntu1/src-bootfloppy'
klcc -Os -Wall -shared init.c -o init
In file included from /usr/lib/klibc/include/sys/types.h:15:0,
                 from /usr/lib/klibc/include/unistd.h:11,
                 from /usr/lib/klibc/include/stdio.h:11,
                 from init.c:14:
/usr/lib/klibc/include/linux/posix_types.h:47:29: fatal error: asm/posix_types.h: No such file or directory
compilation terminated.
make[2]: *** [init] Error 1
make[2]: Leaving directory `/build/buildd/rootskel-1.96ubuntu1/src-bootfloppy'
make[1]: *** [build-recursive] Error 1
make[1]: Leaving directory `/build/buildd/rootskel-1.96ubuntu1'
dh_auto_build: make -j1 returned exit code 2
make: *** [build] Error 2
dpkg-buildpackage: error: debian/rules build gave error exit status 2
Build finished at 20110818-1354
FAILED [dpkg-buildpackage died]
Purging chroot-autobuild/build/buildd/rootskel-1.96ubuntu1

Tags: ftbfs oneiric
Matthias Klose (doko)
Changed in rootskel (Ubuntu Oneiric):
milestone: none → ubuntu-11.10-beta-1
Changed in rootskel (Ubuntu):
importance: Undecided → High
status: New → Invalid
To post a comment you must log in.
This report contains Public information  
Everyone can see this information.

Other bug subscribers

Remote bug watches

Bug watches keep track of this bug in other bug trackers.