python-qt4 version 4.8.5-0ubuntu1 failed to build in oneiric

Bug #829497 reported by Matthias Klose
This bug affects 2 people
Affects Status Importance Assigned to Milestone
python-qt4 (Ubuntu)
Fix Released
Fix Released

Bug Description

python-qt4 version 4.8.5-0ubuntu1 failed to build in oneiric
Link to failed build:

Details about the rebuild:

Direct link to the build log:

This log snippet might be of interest, since it triggered the matcher 'Purging chroot-autobuild'.
Excerpt 2027 lines into the build log:

make[2]: Leaving directory `/build/buildd/python-qt4-4.8.5/dbg-build-2.6/dbus'
make[2]: Entering directory `/build/buildd/python-qt4-4.8.5/dbg-build-2.6/pyuic'
make[2]: Nothing to be done for `all'.
make[2]: Leaving directory `/build/buildd/python-qt4-4.8.5/dbg-build-2.6/pyuic'
make[1]: Leaving directory `/build/buildd/python-qt4-4.8.5/dbg-build-2.6'
touch dbg-build-2.6/build-stamp
 /usr/bin/fakeroot debian/rules binary
dh_prep -a
dh_installdirs -a
sed -i -e '/strip/ d' /build/buildd/python-qt4-4.8.5/build-2.7/designer/Makefile
sed: can't read /build/buildd/python-qt4-4.8.5/build-2.7/designer/Makefile: No such file or directory
make: *** [install-arch] Error 2
dpkg-buildpackage: error: /usr/bin/fakeroot debian/rules binary gave error exit status 2
Build finished at 20110818-1254
FAILED [dpkg-buildpackage died]
Purging chroot-autobuild/build/buildd/python-qt4-4.8.5

Tags: ftbfs oneiric
Matthias Klose (doko)
Changed in python-qt4 (Ubuntu):
milestone: none → ubuntu-11.10-beta-1
status: New → Confirmed
importance: Undecided → High
Revision history for this message
Scott Kitterman (kitterman) wrote :

This was due to a problem in sip4 that's been fixed.

sip4 (4.12.4-0ubuntu2) oneiric; urgency=low

  * Fix mis-application of one hunk in siputils_debian_changes.diff
  * Use new dh_python2 feature --no-dbg-cleaning in place of gross hack in
    debian/rules and bump minimum build-depends version for python-all-dev

Changed in python-qt4 (Ubuntu Oneiric):
status: Confirmed → Fix Released
Revision history for this message
Peter Würtz (pwuertz) wrote :

I just had the same problem when rebuilding Python-qt4 4.10 on ubuntu 13.04. How to fix this?

To post a comment you must log in.
This report contains Public information  
Everyone can see this information.

Other bug subscribers

Remote bug watches

Bug watches keep track of this bug in other bug trackers.