python-ldap-doc version 2.3-2.1 failed to build in oneiric

Bug #835763 reported by Matthias Klose
This bug affects 1 person
Affects Status Importance Assigned to Milestone
python-ldap-doc (Ubuntu)
Fix Released
Barry Warsaw
Fix Released
Barry Warsaw

Bug Description

python-ldap-doc version 2.3-2.1 failed to build in oneiric
Link to failed build:

Details about the rebuild:

Direct link to the build log:

This log snippet might be of interest, since it triggered the matcher 'Purging chroot-autobuild'.
Excerpt 913 lines into the build log:

make[1]: Leaving directory `/build/buildd/python-ldap-doc-2.3'
set -e; \
 v=`dpkg-parsechangelog | sed -n 's/^Version: //p'`; \
 v=${v%-*}; \
 d=`dpkg-parsechangelog | sed -n 's/^Date: //p'`; \
 d=`LC_TIME=C date +"%B %e, %Y" -d "$d"`; \
 printf "\\\\release{$v}\\\\setshortversion{$v}\\\\date{$d}" > Doc/version.tex
cd Doc && /usr/bin/make python-ldap/index.html && rm -f python-ldap/*.idx
make[1]: Entering directory `/build/buildd/python-ldap-doc-2.3/Doc'
/usr/bin/env TEXINPUTS=/usr/lib/python2.5/doc/texinputs:: /usr/lib/python2.5/doc/tools/mkhowto --html python-ldap.tex
/usr/bin/env: /usr/lib/python2.5/doc/tools/mkhowto: No such file or directory
make[1]: *** [python-ldap/index.html] Error 127
make[1]: Leaving directory `/build/buildd/python-ldap-doc-2.3/Doc'
make: *** [build/python-ldap-doc] Error 2
dpkg-buildpackage: error: debian/rules build gave error exit status 2
Build finished at 20110826-1913
FAILED [dpkg-buildpackage died]
Purging chroot-autobuild/build/buildd/python-ldap-doc-2.3

Matthias Klose (doko)
Changed in python-ldap-doc (Ubuntu):
status: New → Confirmed
importance: Undecided → High
Revision history for this message
Marcin Juszkiewicz (hrw) wrote :
Revision history for this message
Barry Warsaw (barry) wrote :

Looks great, thanks Marcin! I'll upload this now.

Changed in python-ldap-doc (Ubuntu Oneiric):
milestone: none → ubuntu-11.10-beta-1
assignee: nobody → Barry Warsaw (barry)
Revision history for this message
Launchpad Janitor (janitor) wrote :

This bug was fixed in the package python-ldap-doc - 2.3-2.1ubuntu1

python-ldap-doc (2.3-2.1ubuntu1) oneiric; urgency=low

  * Bump python version to 2.7 to fix FTFBS - LP: #835763
 -- Marcin Juszkiewicz <email address hidden> Wed, 31 Aug 2011 17:37:11 +0000

Changed in python-ldap-doc (Ubuntu Oneiric):
status: Confirmed → Fix Released
To post a comment you must log in.
This report contains Public information  
Everyone can see this information.

Other bug subscribers

Remote bug watches

Bug watches keep track of this bug in other bug trackers.