cryptsetup version 2:1.1.3-4ubuntu1 failed to build in oneiric

Bug #829474 reported by Matthias Klose
This bug affects 1 person
Affects Status Importance Assigned to Milestone
cryptsetup (Ubuntu)
Fix Released
Fix Released

Bug Description

cryptsetup version 2:1.1.3-4ubuntu1 failed to build in oneiric
Link to failed build:

Details about the rebuild:

Direct link to the build log:

This log snippet might be of interest, since it triggered the matcher 'Purging chroot-autobuild'.
Excerpt 880 lines into the build log:

configure: error: Package requirements (devmapper >= 1.02.03) were not met:

Package libudev was not found in the pkg-config search path.
Perhaps you should add the directory containing `libudev.pc'
to the PKG_CONFIG_PATH environment variable
Package 'libudev', required by 'devmapper', not found

Consider adjusting the PKG_CONFIG_PATH environment variable if you
installed software in a non-standard prefix.

Alternatively, you may set the environment variables DEVMAPPER_CFLAGS
and DEVMAPPER_LIBS to avoid the need to call pkg-config.
See the pkg-config man page for more details.
make: *** [configure-stamp] Error 1
dpkg-buildpackage: error: debian/rules build gave error exit status 2
Build finished at 20110816-2206
FAILED [dpkg-buildpackage died]
Purging chroot-autobuild/build/buildd/cryptsetup-1.1.3

Tags: ftbfs oneiric
Matthias Klose (doko)
Changed in cryptsetup (Ubuntu):
milestone: none → ubuntu-11.10-beta-1
Matthias Klose (doko)
Changed in cryptsetup (Ubuntu Oneiric):
importance: Undecided → High
status: New → Confirmed
Revision history for this message
Steve Langasek (vorlon) wrote :

This was a bug in the dependencies of the devmapper -dev package, not in cryptsetup; a fix has already been uploaded to the archive.

Changed in cryptsetup (Ubuntu Oneiric):
status: Confirmed → Fix Released
To post a comment you must log in.
This report contains Public information  
Everyone can see this information.

Other bug subscribers

Remote bug watches

Bug watches keep track of this bug in other bug trackers.