axis2c version 1.6.0-0ubuntu12 failed to build in oneiric

Bug #829498 reported by Matthias Klose
This bug affects 1 person
Affects Status Importance Assigned to Milestone
axis2c (Ubuntu)
Fix Released
Fix Released

Bug Description

axis2c version 1.6.0-0ubuntu12 failed to build in oneiric
Link to failed build:

Details about the rebuild:

Direct link to the build log:

This log snippet might be of interest, since it triggered the matcher 'Purging chroot-autobuild'.
Excerpt 1752 lines into the build log:

make[6]: *** [uuid_gen_unix.lo] Error 1
make[6]: Leaving directory `/build/buildd/axis2c-1.6.0/util/src/platforms/unix'
make[5]: *** [all-recursive] Error 1
make[5]: Leaving directory `/build/buildd/axis2c-1.6.0/util/src'
make[4]: *** [all-recursive] Error 1
make[4]: Leaving directory `/build/buildd/axis2c-1.6.0/util'
make[3]: *** [all] Error 2
make[3]: Leaving directory `/build/buildd/axis2c-1.6.0/util'
make[2]: *** [all-recursive] Error 1
make[2]: Leaving directory `/build/buildd/axis2c-1.6.0'
make[1]: *** [all] Error 2
make[1]: Leaving directory `/build/buildd/axis2c-1.6.0'
make: *** [debian/stamp-makefile-build] Error 2
dpkg-buildpackage: error: debian/rules build gave error exit status 2
Build finished at 20110816-2346
FAILED [dpkg-buildpackage died]
Purging chroot-autobuild/build/buildd/axis2c-1.6.0

Tags: ftbfs oneiric
Matthias Klose (doko)
Changed in axis2c (Ubuntu):
milestone: none → ubuntu-11.10-beta-1
status: New → Confirmed
importance: Undecided → High
Revision history for this message
Launchpad Janitor (janitor) wrote :

This bug was fixed in the package axis2c - 1.6.0-0ubuntu13

axis2c (1.6.0-0ubuntu13) oneiric; urgency=low

  * Build with -Wno-error=unused-but-set-variable. LP: #829498.
 -- Matthias Klose <email address hidden> Thu, 25 Aug 2011 17:50:12 +0200

Changed in axis2c (Ubuntu Oneiric):
status: Confirmed → Fix Released
To post a comment you must log in.
This report contains Public information  
Everyone can see this information.

Other bug subscribers

Remote bug watches

Bug watches keep track of this bug in other bug trackers.